{"text_format":"1","workbook":"xlsx","n_sheets":19,"sheets":["Instructions","Humorous Monologues","HumorousMR","Dramatic","DramaticMR","Classical","ClassicalMR","Contemporary","ContemporaryMR","Pantomime","PantomimeMR","MusicalTheatre","MusicalTheatreMR","One-Acts","CostumeDesign","ScenicDesign","Sweepstakes","ScenicResults","CostumeResults"],"not_rendered":{"charts":0,"images":0,"macros":1,"external_links":0,"defined_names":2,"comments":0,"pivot_tables":0},"unopened":[],"bounds":{"document_bytes":16777216,"sheet_cells":100000,"rows_first":2000,"rows_last":500,"rows_between":2000,"halvings":0,"cell_chars":16384,"cell_head_chars":4096},"cells_cut":0,"cells_raw":0,"read":"whole","date_system":"1900"}

{"sheet":"Instructions","index":0,"n_rows":13,"n_cols":3,"rows_kept":13,"cut":false,"hidden":false,"merged":[[0,0,0,2],[1,0,1,2],[3,0,3,2],[4,0,4,2]]}
["Directions for Using the UHSAA SCORING SPREADSHEET"]
["for Region and State Theatre Meets:"]
[]
["If you have any questions, please email Giselle Gremmert at giselle.gremmert@canyonsdistrict.org"]
["If there is an emergency the day of your meet, feel free to call or text at 801-391-7864"]
["Before you start...",null,"In the Tab Room..."]
{"$rows_left_out":8}
{"sheet":"Humorous Monologues","index":1,"n_rows":152,"n_cols":33,"rows_kept":152,"cut":false,"hidden":false,"merged":[[0,0,0,8]]}
["Humorous Monologues",null,null,null,null,null,null,null,null,null,"Rank 1-4",null,null,null,null,null,null,null,null,null,null,null,null,"S","E","G","F",null,"1violation","2violations","3violations"]
[null,null,null,null,null,null,null,null,null,null,"Round 1:",null,"Round 2:",null,"Round 3:",null,"-2 for each",null,null,null,null,null,null,null,null,null,null,"Drops lowest from column q"]
[null,null,null,null,null,null,null,"Student Name",null,"Title of Piece","R1 rank","R1 score","R2 rank","R2 score","R3 rank","R3 score","Time Violations",null,"TOTAL SCORE",null,"TOTAL RANK",null,null,"TOTAL SCHOOL SWEEPS POINTS",null,null,null,"Drop Lowest"]
["A-101",null,null,null,null,null,null,"J","Wales","Crystal",4.0,19.0,1.0,23.0,1.0,25.0,null,{"$f":"IF(Q4=\"1violation\",-7*1,IF(Q4=\"2violations\",-7*2,IF(Q4=\"3violations\",-7*3,IF(Q4=\"\",\"\"))))","v":""},{"$f":"SUM(L4,N4,P4,R4)","v":67},null,{"$f":"SUM(K4,M4,O4)","v":6},null,null,null,{"$f":"SUM(S4,S6,S5,S7,-AB4)","v":215},null,null,{"$f":"MIN(S4:S7)","v":67}]
["A-102",null,null,null,null,null,null,"Hunter","Hughes","Little Flying Ace",2.0,24.0,2.0,25.0,3.0,25.0,null,"",74,null,7]
["A-103",null,null,null,null,null,null,"Brexton","Jensen","Cat in the Hat AA",2.0,23.0,1.0,24.0,1.0,25.0,null,"",72,null,4]
{"$rows_left_out":147}
{"sheet":"HumorousMR","index":2,"n_rows":122,"n_cols":12,"rows_kept":122,"cut":false,"hidden":false,"merged":[]}
["Humorous",null,null,null,"Finals Medals Round Scores"]
["ID","Rank","Score","LeaveBlank","MR 1 Rank","MR 1 Score","MR2 Rank","MR 2 Score","MR3 Rank","MR 3 Score","Total MR Rank","Total MR Score"]
[{"$f":"'Humorous Monologues'!A5","v":"A-102"},{"$f":"'Humorous Monologues'!U5","v":7},{"$f":"'Humorous Monologues'!S5","v":74},{"$f":"IF((HumorousMR!$B3+HumorousMR!$C3)>0,1,0)","v":1},null,null,null,null,null,null,{"$f":"SUM(E3,G3,I3)","v":0},0]
[{"$f":"'Humorous Monologues'!A6","v":"A-103"},{"$f":"'Humorous Monologues'!U6","v":4},{"$f":"'Humorous Monologues'!S6","v":72},{"$f":"IF((HumorousMR!$B4+HumorousMR!$C4)>0,1,0)","v":1},2.0,25.0,2.0,24.0,5.0,23.0,{"$f":"SUM(E4,G4,I4)","v":9},72]
[{"$f":"'Humorous Monologues'!A9","v":"B-101"},{"$f":"'Humorous Monologues'!U9","v":12},{"$f":"'Humorous Monologues'!S9","v":66},{"$f":"IF((HumorousMR!$B5+HumorousMR!$C5)>0,1,0)","v":1},null,null,null,null,null,null,{"$f":"SUM(E5,G5,I5)","v":0},0]
[{"$f":"'Humorous Monologues'!A7","v":"A-104"},{"$f":"'Humorous Monologues'!U7","v":9},{"$f":"'Humorous Monologues'!S7","v":69},{"$f":"IF((HumorousMR!$B6+HumorousMR!$C6)>0,1,0)","v":1},null,null,null,null,null,null,{"$f":"SUM(E6,G6,I6)","v":0},0]
{"$rows_left_out":117}
{"sheet":"Dramatic","index":3,"n_rows":152,"n_cols":31,"rows_kept":152,"cut":false,"hidden":false,"merged":[[0,0,0,8]]}
["Dramatic Monologues",null,null,null,null,null,null,null,null,null,"Rank 1-4",null,null,null,null,null,null,null,null,null,null,null,null,"S","E","G","F",null,"1violation","2violations","3violations"]
[null,null,null,null,null,null,null,null,null,null,"Round 1:",null,"Round 2:",null,"Round 3:",null,"-2 for each",null,null,null,null,null,null,null,null,null,null,"Drops lowest from column q"]
[null,null,null,null,null,null,null,"Student Name",null,"Title of Piece","R1 rank","R1 score","R2 rank","R2 score","R3 rank","R3 score","Time Violations",null,"TOTAL SCORE",null,"TOTAL RANK",null,null,"TOTAL SCHOOL SWEEPS POINTS",null,null,null,"Drop Lowest"]
["A-201",null,null,null,null,null,null,"Brielle","Bratton","Electric Chair",2.0,25.0,4.0,23.0,1.0,25.0,null,{"$f":"IF(Q4=\"1violation\",-7*1,IF(Q4=\"2violations\",-7*2,IF(Q4=\"3violations\",-7*3,IF(Q4=\"\",\"\"))))","v":""},{"$f":"SUM(L4,N4,P4,R4)","v":73},null,{"$f":"SUM(K4,M4,O4)","v":7},null,null,null,{"$f":"SUM(S4,S6,S5,S7,-AB4)","v":214},null,null,{"$f":"MIN(S4:S7)","v":68}]
["A-202",null,null,null,null,null,null,"Jesse","Howick","Justice",1.0,25.0,4.0,24.0,2.0,20.0,null,"",69,null,7]
["A-203",null,null,null,null,null,null,"Rachel","Tanner","Should I stay?",4.0,22.0,1.0,25.0,3.0,21.0,null,"",68,null,8]
{"$rows_left_out":147}
{"sheet":"DramaticMR","index":4,"n_rows":122,"n_cols":12,"rows_kept":122,"cut":false,"hidden":false,"merged":[]}
["Dramatic",null,null,null,"Finals Medals Round Scores"]
["ID","Rank","Score","LeaveBlank","MR 1 Rank","MR 1 Score","MR2 Rank","MR 2 Score","MR3 Rank","MR 3 Score","Total MR Rank","Total MR Score"]
[{"$f":"Dramatic!A4","v":"A-201"},{"$f":"Dramatic!U4","v":7},{"$f":"Dramatic!S4","v":73},{"$f":"IF((DramaticMR!$B3+DramaticMR!$C3)>0,1,0)","v":1},null,null,null,null,null,null,{"$f":"SUM(E3,G3,I3)","v":0},0]
[{"$f":"Dramatic!A5","v":"A-202"},{"$f":"Dramatic!U5","v":7},{"$f":"Dramatic!S5","v":69},{"$f":"IF((DramaticMR!$B4+DramaticMR!$C4)>0,1,0)","v":1},null,null,null,null,null,null,{"$f":"SUM(E4,G4,I4)","v":0},0]
[{"$f":"Dramatic!A6","v":"A-203"},{"$f":"Dramatic!U6","v":8},{"$f":"Dramatic!S6","v":68},{"$f":"IF((DramaticMR!$B5+DramaticMR!$C5)>0,1,0)","v":1},null,null,null,null,null,null,{"$f":"SUM(E5,G5,I5)","v":0},0]
[{"$f":"Dramatic!A7","v":"A-204"},{"$f":"Dramatic!U7","v":5},{"$f":"Dramatic!S7","v":72},{"$f":"IF((DramaticMR!$B6+DramaticMR!$C6)>0,1,0)","v":1},4.0,24.0,4.0,25.0,3.0,24.0,{"$f":"SUM(E6,G6,I6)","v":11},73]
{"$rows_left_out":117}
{"sheet":"Classical","index":5,"n_rows":152,"n_cols":31,"rows_kept":152,"cut":false,"hidden":false,"merged":[]}
["Classical Scenes",null,null,null,null,null,null,null,null,null,"Rank 1-4",null,null,null,null,null,null,null,null,null,null,null,null,"S","E","G","F",null,"1violation","2violations","3violations"]
[null,null,null,null,null,null,null,null,null,null,"Round 1:",null,"Round 2:",null,"Round 3:",null,"-2 for each",null,null,null,null,null,null,null,null,null,null,"Drops lowest from column q"]
[null,null,null,"Student Name",null,"Student Name",null,"Student Name",null,"Title of Piece","R1 rank","R1 score","R2 rank","R2 score","R3 rank","R3 score","Time Violations",null,"TOTAL SCORE",null,"TOTAL RANK",null,null,"TOTAL SCHOOL SWEEPS POINTS",null,null,null,"Drop Lowest"]
["A-301",null,null,"Dana","Carlisle","Anjolee","Jones","Lina","Rascon","As you like it",4.0,25.0,2.0,24.0,3.0,24.0,null,{"$f":"IF(Q4=\"1violation\",-7*1,IF(Q4=\"2violations\",-7*2,IF(Q4=\"3violations\",-7*3,IF(Q4=\"\",\"\"))))","v":""},{"$f":"SUM(L4,N4,P4,R4)","v":73},null,{"$f":"SUM(K4,M4,O4)","v":9},null,null,null,{"$f":"SUM(S4,S6,S5,S7,-AB4)","v":223},null,null,{"$f":"MIN(S4:S7)","v":73}]
["A-302",null,null,"Hailey","Howard","Brielle","Knapp","Lindsey","Olsen","Assembly Women",3.0,25.0,2.0,25.0,4.0,24.0,null,"",74,null,9]
["A-303",null,null,"Kailee","Schiffman","Matthew","Lundeberg",null,null,"Tartuffe",1.0,25.0,1.0,25.0,4.0,24.0,null,"",74,null,6]
{"$rows_left_out":147}
{"sheet":"ClassicalMR","index":6,"n_rows":122,"n_cols":12,"rows_kept":122,"cut":false,"hidden":false,"merged":[]}
["Classical",null,null,null,"Finals Medals Round Scores"]
["ID","Rank","Score","LeaveBlank","MR 1 Rank","MR 1 Score","MR2 Rank","MR 2 Score","MR3 Rank","MR 3 Score","Total MR Rank","Total MR Score"]
[{"$f":"Classical!A4","v":"A-301"},{"$f":"Classical!U4","v":9},{"$f":"Classical!S4","v":73},{"$f":"IF((ClassicalMR!$B3+ClassicalMR!$C3)>0,1,0)","v":1},null,null,null,null,null,null,{"$f":"SUM(E3,G3,I3)","v":0},0]
[{"$f":"Classical!A5","v":"A-302"},{"$f":"Classical!U5","v":9},{"$f":"Classical!S5","v":74},{"$f":"IF((ClassicalMR!$B4+ClassicalMR!$C4)>0,1,0)","v":1},null,null,null,null,null,null,{"$f":"SUM(E4,G4,I4)","v":0},0]
[{"$f":"Classical!A6","v":"A-303"},{"$f":"Classical!U6","v":6},{"$f":"Classical!S6","v":74},{"$f":"IF((ClassicalMR!$B5+ClassicalMR!$C5)>0,1,0)","v":1},6.0,25.0,6.0,25.0,3.0,25.0,{"$f":"SUM(E5,G5,I5)","v":15},75]
[{"$f":"Classical!A7","v":"A-304"},{"$f":"Classical!U7","v":3},{"$f":"Classical!S7","v":75},{"$f":"IF((ClassicalMR!$B6+ClassicalMR!$C6)>0,1,0)","v":1},5.0,25.0,4.0,25.0,1.0,25.0,{"$f":"SUM(E6,G6,I6)","v":10},75]
{"$rows_left_out":117}
{"sheet":"Contemporary","index":7,"n_rows":152,"n_cols":31,"rows_kept":152,"cut":false,"hidden":false,"merged":[]}
["Contemporary Scenes",null,null,null,null,null,null,null,null,null,"Rank 1-4",null,null,null,null,null,null,null,null,null,null,null,null,"S","E","G","F",null,"1violation","2violations","3violations"]
[null,null,null,null,null,null,null,null,null,null,"Round 1:",null,"Round 2:",null,"Round 3:",null,"-2 for each",null,null,null,null,null,null,null,null,null,null,"Drops lowest from column q"]
[null,null,null,"Student Name",null,"Student Name",null,"Student Name",null,"Title of Piece","R1 rank","R1 score","R2 rank","R2 score","R3 rank","R3 score","Time Violations",null,"TOTAL SCORE",null,"TOTAL RANK",null,null,"TOTAL SCHOOL SWEEPS POINTS",null,null,null,"Drop Lowest"]
["A-401",null,null,"Hattie","Stubbs","Quin","Zolinger",null,null,"You Belong To me",1.0,25.0,2.0,25.0,3.0,15.0,null,{"$f":"IF(Q4=\"1violation\",-7*1,IF(Q4=\"2violations\",-7*2,IF(Q4=\"3violations\",-7*3,IF(Q4=\"\",\"\"))))","v":""},{"$f":"SUM(L4,N4,P4,R4)","v":65},null,{"$f":"SUM(K4,M4,O4)","v":6},null,null,null,{"$f":"SUM(S4,S6,S5,S7,-AB4)","v":199},null,null,{"$f":"MIN(S4:S7)","v":57}]
["A-402",null,null,"Cayden","Hirschi","Kennedy","Lundeberg",null,null,"Proposals",4.0,22.0,4.0,15.0,1.0,23.0,null,"",60,null,9]
["A-403",null,null,"Matthew","Bishop","Alivia","Shumway","McKay","Steck","Stolen",4.0,17.0,2.0,21.0,4.0,19.0,null,"",57,null,10]
{"$rows_left_out":147}
{"sheet":"ContemporaryMR","index":8,"n_rows":122,"n_cols":12,"rows_kept":122,"cut":false,"hidden":false,"merged":[]}
[" ",null,null,null,"Finals Medals Round Scores"]
["ID","Rank","Score","LeaveBlank","MR 1 Rank","MR 1 Score","MR2 Rank","MR 2 Score","MR3 Rank","MR 3 Score","Total MR Rank","Total MR Score"]
[{"$f":"Contemporary!A4","v":"A-401"},{"$f":"Contemporary!U4","v":6},{"$f":"Contemporary!S4","v":65},{"$f":"IF((ContemporaryMR!$B3+ContemporaryMR!$C3)>0,1,0)","v":1},null,null,null,null,null,null,{"$f":"SUM(E3,G3,I3)","v":0},0]
[{"$f":"Contemporary!A5","v":"A-402"},{"$f":"Contemporary!U5","v":9},{"$f":"Contemporary!S5","v":60},{"$f":"IF((ContemporaryMR!$B4+ContemporaryMR!$C4)>0,1,0)","v":1},null,null,null,null,null,null,{"$f":"SUM(E4,G4,I4)","v":0},0]
[{"$f":"Contemporary!A6","v":"A-403"},{"$f":"Contemporary!U6","v":10},{"$f":"Contemporary!S6","v":57},{"$f":"IF((ContemporaryMR!$B5+ContemporaryMR!$C5)>0,1,0)","v":1},null,null,null,null,null,null,{"$f":"SUM(E5,G5,I5)","v":0},0]
[{"$f":"Contemporary!A7","v":"A-404"},{"$f":"Contemporary!U7","v":7},{"$f":"Contemporary!S7","v":74},{"$f":"IF((ContemporaryMR!$B6+ContemporaryMR!$C6)>0,1,0)","v":1},null,null,null,null,null,null,{"$f":"SUM(E6,G6,I6)","v":0},0]
{"$rows_left_out":117}
{"sheet":"Pantomime","index":9,"n_rows":152,"n_cols":31,"rows_kept":152,"cut":false,"hidden":false,"merged":[]}
["Pantomimes",null,null,null,null,null,null,null,null,null,"Rank 1-4",null,null,null,null,null,null,null,null,null,null,null,null,"S","E","G","F",null,"1violation","2violations","3violations"]
[null,null,null,null,null,null,null,null,null,null,"Round 1:",null,"Round 2:",null,"Round 3:",null,"-2 for each",null,null,null,null,null,null,null,null,null,null,"Drops lowest from column q"]
[null,null,null,null,null,"Student Name",null,"Student Name",null,"Title of Piece","R1 rank","R1 score","R2 rank","R2 score","R3 rank","R3 score","Time Violations",null,"TOTAL SCORE",null,"TOTAL RANK",null,null,"TOTAL SCHOOL SWEEPS POINTS",null,null,null,"Drop Lowest"]
["A-501",null,null,null,null,null,"Adamson",null,"Everitt","Cinderella's Revenge",3.0,25.0,1.0,25.0,1.0,24.0,null,{"$f":"IF(Q4=\"1violation\",-7*1,IF(Q4=\"2violations\",-7*2,IF(Q4=\"3violations\",-7*3,IF(Q4=\"\",\"\"))))","v":""},{"$f":"SUM(L4,N4,P4,R4)","v":74},null,{"$f":"SUM(K4,M4,O4)","v":5},null,null,null,{"$f":"SUM(S4,S6,S5,S7,-AB4)","v":222},null,null,{"$f":"MIN(S4:S7)","v":72}]
["A-502",null,null,null,null,null,"Dettinger",null,"Everitt","Real vs Dream ",1.0,25.0,1.0,24.0,1.0,24.0,null,"",73,null,3]
["A-503",null,null,null,null,null,"Egg",null,"Hansen","Elevator Birth",2.0,24.0,4.0,23.0,1.0,25.0,null,"",72,null,7]
{"$rows_left_out":147}
{"sheet":"PantomimeMR","index":10,"n_rows":122,"n_cols":12,"rows_kept":122,"cut":false,"hidden":false,"merged":[]}
["Pantomime",null,null,null,"Finals Medals Round Scores"]
["ID","Rank","Score","LeaveBlank","MR 1 Rank","MR 1 Score","MR2 Rank","MR 2 Score","MR3 Rank","MR 3 Score","Total MR Rank","Total MR Score"]
[{"$f":"Pantomime!A4","v":"A-501"},{"$f":"Pantomime!U4","v":5},{"$f":"Pantomime!S4","v":74},{"$f":"IF((PantomimeMR!$B3+PantomimeMR!$C3)>0,1,0)","v":1},2.0,25.0,6.0,23.0,6.0,24.0,{"$f":"SUM(E3,G3,I3)","v":14},72]
[{"$f":"Pantomime!A5","v":"A-502"},{"$f":"Pantomime!U5","v":3},{"$f":"Pantomime!S5","v":73},{"$f":"IF((PantomimeMR!$B4+PantomimeMR!$C4)>0,1,0)","v":1},6.0,24.0,5.0,25.0,6.0,22.0,{"$f":"SUM(E4,G4,I4)","v":17},71]
[{"$f":"Pantomime!A6","v":"A-503"},{"$f":"Pantomime!U6","v":7},{"$f":"Pantomime!S6","v":72},{"$f":"IF((PantomimeMR!$B5+PantomimeMR!$C5)>0,1,0)","v":1},null,null,null,null,null,null,{"$f":"SUM(E5,G5,I5)","v":0},0]
[{"$f":"Pantomime!A7","v":"A-504"},{"$f":"Pantomime!U7","v":4},{"$f":"Pantomime!S7","v":75},{"$f":"IF((PantomimeMR!$B6+PantomimeMR!$C6)>0,1,0)","v":1},4.0,24.0,6.0,25.0,3.0,25.0,{"$f":"SUM(E6,G6,I6)","v":13},74]
{"$rows_left_out":117}
{"sheet":"MusicalTheatre","index":11,"n_rows":152,"n_cols":32,"rows_kept":152,"cut":false,"hidden":false,"merged":[[1,9,1,10]]}
["Musical Theatre",null,null,null,null,null,null,null,null,null,null,"Rank 1-4",null,null,null,null,null,null,null,null,null,null,null,null,"S","E","G","F",null,"1violation","2violations","3violations"]
[null,null,null,null,null,null,null,null,null,"*only need one of these",null,"Round 1:",null,"Round 2:",null,"Round 3:",null,"-2 for each",null,null,null,null,null,null,null,null,null,null,"Drops lowest from column q"]
[null,"Student Name",null,"Student Name",null,"Student Name",null,"Student Name",null,"Title of Piece","Title of Musical","R1 rank","R1 score","R2 rank","R2 score","R3 rank","R3 score","Time Violations",null,"TOTAL SCORE",null,"TOTAL RANK",null,null,"TOTAL SCHOOL SWEEPS POINTS",null,null,null,"Drop Lowest"]
["A-601","Kate","Stevens",null,null,null,null,null,null,"Fancy Meeting","Lucky Stiff",1.0,25.0,1.0,25.0,1.0,25.0,null,{"$f":"IF(R4=\"1violation\",-7*1,IF(R4=\"2violations\",-7*2,IF(R4=\"3violations\",-7*3,IF(R4=\"\",\"\"))))","v":""},{"$f":"SUM(M4,O4,Q4,S4)","v":75},null,{"$f":"SUM(L4,N4,P4)","v":3},null,null,null,{"$f":"SUM(T4,T6,T5,T7,-AC4)","v":219},null,null,{"$f":"MIN(T4:T7)","v":62}]
["A-602",null,"Lundeberg",null,"Schiffman",null,null,null,null,"Crazier than you","Addams Family",2.0,25.0,4.0,24.0,1.0,25.0,null,"",74,null,7]
["A-603",null,"Nordfelt",null,"Nipko",null,null,null,null,"Agony","Into the Woods",3.0,22.0,4.0,16.0,2.0,24.0,null,"",62,null,9]
{"$rows_left_out":147}
{"sheet":"MusicalTheatreMR","index":12,"n_rows":122,"n_cols":12,"rows_kept":122,"cut":false,"hidden":false,"merged":[]}
["Musical Theatre",null,null,null,"Finals Medals Round Scores"]
["ID","Rank","Score","LeaveBlank","MR 1 Rank","MR 1 Score","MR2 Rank","MR 2 Score","MR3 Rank","MR 3 Score","Total MR Rank","Total MR Score"]
[{"$f":"MusicalTheatre!A4","v":"A-601"},{"$f":"MusicalTheatre!V4","v":3},{"$f":"MusicalTheatre!T4","v":75},{"$f":"IF((MusicalTheatreMR!$B3+MusicalTheatreMR!$C3)>0,1,0)","v":1},1.0,25.0,1.0,25.0,3.0,25.0,{"$f":"SUM(E3,G3,I3)","v":5},75]
[{"$f":"MusicalTheatre!A5","v":"A-602"},{"$f":"MusicalTheatre!V5","v":7},{"$f":"MusicalTheatre!T5","v":74},{"$f":"IF((MusicalTheatreMR!$B4+MusicalTheatreMR!$C4)>0,1,0)","v":1},null,null,null,null,null,null,{"$f":"SUM(E4,G4,I4)","v":0},0]
[{"$f":"MusicalTheatre!A6","v":"A-603"},{"$f":"MusicalTheatre!V6","v":9},{"$f":"MusicalTheatre!T6","v":62},{"$f":"IF((MusicalTheatreMR!$B5+MusicalTheatreMR!$C5)>0,1,0)","v":1},null,null,null,null,null,null,{"$f":"SUM(E5,G5,I5)","v":0},0]
[{"$f":"MusicalTheatre!A7","v":"A-604"},{"$f":"MusicalTheatre!V7","v":8},{"$f":"MusicalTheatre!T7","v":70},{"$f":"IF((MusicalTheatreMR!$B6+MusicalTheatreMR!$C6)>0,1,0)","v":1},null,null,null,null,null,null,{"$f":"SUM(E6,G6,I6)","v":0},0]
{"$rows_left_out":117}
{"sheet":"One-Acts","index":13,"n_rows":33,"n_cols":35,"rows_kept":33,"cut":false,"hidden":false,"merged":[[0,0,0,8]]}
["ONE-ACTS",null,null,null,null,null,null,null,null,null,"Rank 1-6",null,null,null,null,null,null,null,null,null,null,null,null,null,null,null,null,null,null,"S","E","G","F",null,"1violation"]
[null,null,null,null,null,null,null,null,null,null,"Judge 1",null,"Judge 2",null,"Judge 3"]
[null,"Title of Piece",null,null,null,null,null,null,null,null,"J1 rank","J1 score","J2 rank","J2 score","J3 rank","J3 score",null,null,"TOTAL RANK",null,"TOTAL SCORE",null,"TOTAL SCHOOL SWEEPS POINTS",null,null,"Time Violations"]
["A-701","12 Angry Jurors",null,null,null,null,null,null,null,null,1.0,50.0,1.0,48.0,3.0,46.0,null,null,{"$f":"SUM(K4,M4,O4)","v":5},null,{"$f":"SUM(L4,N4,P4)","v":144},null,{"$f":"SUM(U4,AA4)","v":144},null,null,null,{"$f":"IF(Z4=\"1violation\",-35*1,IF(Z4=\"2violations\",-35*2,IF(Z4=\"3violations\",-35*3,IF(Z4=\"\",\"\"))))","v":""}]
["B-701",null,null,null,null,null,null,null,null,null,null,null,null,null,null,null,null,null,0,null,0,null,0,null,null,null,{"$f":"IF(Z5=\"1violation\",-10*1,IF(Z5=\"2violations\",-10*2,IF(Z5=\"3violations\",-10*3,IF(Z5=\"\",\"\"))))","v":""}]
["C-701","Almost Maine",null,null,null,null,null,null,null,null,3.0,50.0,2.0,48.0,1.0,47.0,null,null,6,null,145,null,145,null,null,null,""]
{"$rows_left_out":28}
{"sheet":"CostumeDesign","index":14,"n_rows":152,"n_cols":31,"rows_kept":152,"cut":false,"hidden":false,"merged":[[0,0,0,8]]}
["Costume Design",null,null,null,null,null,null,null,null,null,"Rank 1-6",null,null,null,null,null,null,null,null,null,null,null,null,null,null,null,null,null,"1violation","2violations","3violations"]
[null,null,null,null,null,null,null,null,null,null,"Round 1:",null,"Round 2:",null,"Round 3:"]
[null,null,null,null,null,null,null,"Student Name",null,null,"R1 rank","R1 score","R2 rank","R2 score","R3 rank","R3 score",null,null,"TOTAL SCORE",null,"TOTAL RANK"]
["A-801",null,null,null,null,null,null,null,null,null,null,null,null,null,null,null,null,null,{"$f":"SUM(L4,N4,P4)","v":0},null,{"$f":"SUM(K4,M4,O4)","v":0}]
["A-802",null,null,null,null,null,null,null,null,null,null,null,null,null,null,null,null,null,0,null,0]
["A-803",null,null,null,null,null,null,null,null,null,null,null,null,null,null,null,null,null,0,null,0]
{"$rows_left_out":147}
{"sheet":"ScenicDesign","index":15,"n_rows":152,"n_cols":31,"rows_kept":152,"cut":false,"hidden":false,"merged":[[0,0,0,8]]}
["Scenic Design",null,null,null,null,null,null,null,null,null,"Rank 1-6",null,null,null,null,null,null,null,null,null,null,null,null,null,null,null,null,null,"1violation","2violations","3violations"]
[null,null,null,null,null,null,null,null,null,null,"Round 1:",null,"Round 2:",null,"Round 3:"]
[null,null,null,null,null,null,null,"Student Name",null,null,"R1 rank","R1 score","R2 rank","R2 score","R3 rank","R3 score",null,null,"TOTAL SCORE",null,"TOTAL RANK"]
["A-901",null,null,null,null,null,null,"Alison","Olson",null,3.0,22.0,3.0,25.0,1.0,25.0,null,null,{"$f":"SUM(L4,N4,P4)","v":72},null,{"$f":"SUM(K4,M4,O4)","v":7}]
["A-902",null,null,null,null,null,null,null,null,null,null,null,null,null,null,null,null,null,0,null,0]
["A-903",null,null,null,null,null,null,null,null,null,null,null,null,null,null,null,null,null,0,null,0]
{"$rows_left_out":147}
{"sheet":"Sweepstakes","index":16,"n_rows":33,"n_cols":23,"rows_kept":33,"cut":false,"hidden":false,"merged":[]}
["FINAL SWEEPSTAKES SCORES"]
[]
[null,"School Name",null,"HUMOROUS MONOLOGUES",null,null,"DRAMATIC MONOLOGUES",null,null,"CLASSICAL SCENES",null,null,"CONTEMPORARY SCENES",null,null,"PANTOMIMES",null,"MUSICAL THEATRE",null,null,"ONE-ACT",null,"TOTAL"]
["A","Manti",null,null,{"$f":"SUM('Humorous Monologues'!Y4)","v":215},null,null,{"$f":"SUM(Dramatic!Y4)","v":214},null,null,{"$f":"SUM(Classical!Y4)","v":223},null,null,{"$f":"SUM(Contemporary!Y4)","v":199},null,{"$f":"SUM(Pantomime!Y4)","v":222},null,{"$f":"SUM(MusicalTheatre!Z4)","v":219},null,null,{"$f":"'One-Acts'!W4","v":144},null,{"$f":"SUM(E4:U4)","v":1436}]
["B","Delta",null,null,{"$f":"SUM('Humorous Monologues'!Y9)","v":66},null,null,{"$f":"SUM(Dramatic!Y9)","v":0},null,null,{"$f":"SUM(Classical!Y9)","v":0},null,null,{"$f":"SUM(Contemporary!Y9)","v":59},null,{"$f":"SUM(Pantomime!Y9)","v":0},null,{"$f":"SUM(MusicalTheatre!Z9)","v":141},null,null,{"$f":"'One-Acts'!W5","v":0},null,266]
["C","Union",null,null,{"$f":"SUM('Humorous Monologues'!Y14)","v":221},null,null,{"$f":"SUM(Dramatic!Y14)","v":217},null,null,{"$f":"SUM(Classical!Y14)","v":218},null,null,{"$f":"SUM(Contemporary!Y14)","v":219},null,{"$f":"SUM(Pantomime!Y14)","v":219},null,{"$f":"SUM(MusicalTheatre!Z14)","v":219},null,null,{"$f":"'One-Acts'!W6","v":145},null,1458]
{"$rows_left_out":28}
{"sheet":"ScenicResults","index":17,"n_rows":122,"n_cols":4,"rows_kept":122,"cut":false,"hidden":false,"merged":[]}
["Scenic Design"]
["ID","Rank","Score","LeaveBlank"]
[{"$f":"ScenicDesign!A4","v":"A-901"},{"$f":"ScenicDesign!U4","v":7},{"$f":"ScenicDesign!S4","v":72},{"$f":"IF((ScenicResults!$B3+ScenicResults!$C3)>0,1,0)","v":1}]
[{"$f":"ScenicDesign!A5","v":"A-902"},{"$f":"ScenicDesign!U5","v":0},{"$f":"ScenicDesign!S5","v":0},{"$f":"IF((ScenicResults!$B4+ScenicResults!$C4)>0,1,0)","v":0}]
[{"$f":"ScenicDesign!A6","v":"A-903"},{"$f":"ScenicDesign!U6","v":0},{"$f":"ScenicDesign!S6","v":0},{"$f":"IF((ScenicResults!$B5+ScenicResults!$C5)>0,1,0)","v":0}]
[{"$f":"ScenicDesign!A7","v":"A-904"},{"$f":"ScenicDesign!U7","v":0},{"$f":"ScenicDesign!S7","v":0},{"$f":"IF((ScenicResults!$B6+ScenicResults!$C6)>0,1,0)","v":0}]
{"$rows_left_out":117}
{"sheet":"CostumeResults","index":18,"n_rows":122,"n_cols":4,"rows_kept":122,"cut":false,"hidden":false,"merged":[]}
["Costume Design"]
["ID","Rank","Score","LeaveBlank"]
[{"$f":"CostumeDesign!A4","v":"A-801"},{"$f":"CostumeDesign!U4","v":0},{"$f":"CostumeDesign!S4","v":0},{"$f":"IF((CostumeResults!$B3+CostumeResults!$C3)>0,1,0)","v":0}]
[{"$f":"CostumeDesign!A5","v":"A-802"},{"$f":"CostumeDesign!U5","v":0},{"$f":"CostumeDesign!S5","v":0},{"$f":"IF((CostumeResults!$B4+CostumeResults!$C4)>0,1,0)","v":0}]
[{"$f":"CostumeDesign!A6","v":"A-803"},{"$f":"CostumeDesign!U6","v":0},{"$f":"CostumeDesign!S6","v":0},{"$f":"IF((CostumeResults!$B5+CostumeResults!$C5)>0,1,0)","v":0}]
[{"$f":"CostumeDesign!A7","v":"A-804"},{"$f":"CostumeDesign!U7","v":0},{"$f":"CostumeDesign!S7","v":0},{"$f":"IF((CostumeResults!$B6+CostumeResults!$C6)>0,1,0)","v":0}]
{"$rows_left_out":116}